�S���n�������c�̃R�[�h,�@�l�ԍ�,ID,�n�������c�̖�,����,����_�J�i,����_�p��,POI�R�[�h,���ݒn_�S���n�������c�̃R�[�h,����ID,���ݒn_�A���\�L,���ݒn_�s���{��,���ݒn_�s�撬��,���ݒn_����,���ݒn_�Ԓn�ȉ�,��������(����),�ܓx,�o�x,���x�̎��,���x�̒l,���p�\�j��,�J�n����,�I������,���p�\�������L����,����(��{),����(�ڍ�),����,����_�p��,�A�N�Z�X���@,���ԏ���,�Ԉ֎q��,�Ԉ֎q�ݏo,�c�G�ݏo,�o���A�t���[�g�C��,�X���[�v�A�G���x�[�^�A�G�X�J���[�^,�_���u���b�N���̈ړ��x��,�_����Ǐ�ɂ��x��,�ӓ����E����A����������,����,�M�k�Ή�,�D�撓�ԏ�,�I�X�g���C�g�Ή��g�C��,������,���ނւ��R�[�i�[,���H��,�x�r�[�J�[�ݏo,�x�r�[�J�[���p,�A���於��,�A����d�b�ԍ�,�A��������ԍ�,�A���惁�[���A�h���X,�A����FormURL,�A������l�i���̑��ASNS�Ȃǁj,�X�֔ԍ�,�摜,�摜_���C�Z���X,URL,���l,
170003,,JJ0000000001,�ΐ쌧,�䂯�ނ�̏h�@���p��,���P�����m���h�@�r�����\�E,yukemurinoyado�@biwanso,2304,172022,,�ΐ쌧�����s�a�q���a�̍�3-1,�ΐ쌧,�����s,�a�q���a�̍�,3-1,,37.08867251,136.9188668,,,,�`�F�b�N�C��15��00���@�`�F�b�N�A�E�g10��00��,,,"����14,850�~�`�i���p�\�N���W�b�g�J�[�h:VISA,MASTER,JCB����v�J�[�h�j",," �C�̌i�F�ƐV�N�ȊC�̍K�A�����ċɏ�̉���Ŕ\�o�𖞋i���Ă��������B�G���g�����X�̐�ɍL����C�̌i�F�Ɋ����������p�̗Y��ȊC�̌i�F���A�I�V���C�͂��ߊٓ��̗l�X�ȃX�y�[�X���炲�������܂��B���{�C�̊C�̍K���ӂ񂾂�Ɋ��������������ɐ�ۂ������āA�̂̐c���牷�܂�ɏ�̉���ŋɏ�̋x�������߂������������B",,"�\�z���a�qIC���5��,��ʃA�N�Z�X(����)",�����@150��,,,,,,,,,,,,,,,,,,,0767-62-2323,,,,,,,,http://www.biwanso.com,,
170003,,JJ0000000002,�ΐ쌧,�����h�Ɂ@�\�o���q��,�R�N�~���V���N�V�� �m�g�I�}�L�_�C,kokuminshukusha notomakidai,2311,172022,,�ΐ쌧�����s���������q�䕔55,�ΐ쌧,�����s,���������q�䕔,55,,37.143423,136.875179,,,,"�`�F�b�N�C���@15��00���`�F�b�N�A�E�g�@10��00��			",,,"1�l1���@6,600�~�` ���ڂ����̓z�[���y�[�W���������������B",,�@�\�o������������̒��ɂ���h�Ɂu���q��v�ł��B�����k�p�̔������i�ρA�����͗��R�A���]�߂܂��B�����̗����́A�\�o�̕ω��ɕx�񂾒n�`����񂾎l�G�܁X�̎R�C�̍K�����\�ł��܂��B�n�����������Y�́u���y�Y�Ώāv�́A�~�ɐl�C�̖��o�ł��B�H���ɓV�R����̑嗁��ŁA������肭�낰�܂��B,,"�̂Ɨ��R�C�����cIC���Ԃ�10��			,��ʃA�N�Z�X(����)","55��			",,,,,,,,,,,,,,,,,,,0767-66-1121,,,,,,,,http://www.omakidai.jp/,,
170003,,JJ0000000003,�ΐ쌧,�������̑��\�o����,�C�R�C�m�����m�g�n���g�E,ikoinomuranotohanto,2311,173843,,�ΐ쌧�H��S�u�꒬�u��̋�����,�ΐ쌧,�u�꒬,�ΐ쌧�H��S�u�꒬�u��̋�����,,,37.0241699,136.7603417,,,,"�`�F�b�N�C���@15��00���`�F�b�N�A�E�g�@10��00��",,,,,"���ʂ��L�x�ȉ���ƐV�N�ȋ���ނ𐶂����������A�����ĐS�����߂��u�����ĂȂ��v�ŗ��p�q���o�}���Ă���܂��B�L���Ȏ��R�Ɉ͂܂ꂽ�u�������̑��\�o�����v�́A�z�e���A�y���V�����A�ʑ����������Ԕ\�o�ő勉�̃��]�[�g�G���A�u�u��̋��v�̒��S���ɂ���܂��B�����h�[��8���̍L��ȕ~�n�ɂ́A�V���n�Ȃǂ̃��W���[�{�݂��[�����Ă���A���ӂɂ̓e�j�X��S���t�Ȃǂ��ł��鐔�����̃X�|�[�c�{�݂��[�����Ă��܂��B���R�C�܂܂ɁA�[���������Ԃ��߂����Ă��������B",,"�̂Ɨ��R�C�� ���RIC�����10��,","��p��200����^�o�X10��",,,,,,,,,,,,,,,,,,,0767-32-3131,,,,,,,,http://www.noto-ikoinomura.com,,
170003,,JJ0000000004,�ΐ쌧,���h ����̏h �܂���,�~���V���N �A�J���m���h�@�}�c�_�\�E,minshuku akarinoyado�@matsudaso,,172057,,�ΐ쌧��F�s�ѓc��26-42-1,�ΐ쌧,��F�s,�ѓc��,26-42-1,,37.438875,137.269428,,,,"�`�F�b�N�C���@�@16��00���`�F�b�N�A�E�g�@10��00��			",,,"1��2�H�t���@8,800�~�`",,�@�\�o�����̐�[�ɂ���A�v�w�ŉc�ގ���̏h�ł��B���\�o�ό��̋��_�Ƃ��ė��p����ƁA�ƂĂ��֗��ł��B�������̗����́A�{�̒n���Y�̋���ށA�͔|�҂��킩���؂��g�p���Ă��܂��B�y�b�g�Ɣ��܂�镔�����D�]�ł��B,,"����w������}�o�X�Ŕ\�o��`�܂�2����30���B�\�o��`���ӂ邳�ƃ^�N�V�[��40��,",10��,,,,,,,,,,,,,,,,,,,0768-82-1117,,,,,,,,http://matsudasou.com,,
170003,,JJ0000000005,�ΐ쌧,���򖯏h�@����,�I���Z���~���V���N�@�C�T���r,onsemminshuku�@isaribi,,172049,,�ΐ쌧�֓��s���r�����L���^4,�ΐ쌧,�֓��s,���r�����L���^,4,,37.3933557,136.8362371,,,,�`�F�b�N�C��15:00�@�`�F�b�N�A�E�g10:00�i�v���k�j,,,"1��2�H�i��l�j�@8,000�~�`�i����ŁA�����ŕʁER3�Q�l�����j�i�N���W�b�g�J�[�h�g�p�s�j",," ���������A�����I�ȋ�Ԃł��B�s��̎G������A��u�ł�����Ă݂܂��񂩁B�l�Ƃ̐G�ꍇ���ɋC�Â��Ă݂܂��񂩁B�l�̎�Ŏ�葱����ꂽ���R���A�ꏏ�Ɍq���Ă����܂��傤�B�@ �@",,"�E�֓��s�X���猧��38�����Ŗ�20��,",�L��i���ʎ�10��@�����j,,,,,,,,,,,,,,,,,,,0768-22-2410,,,,,,,,https://wajimanavi.jp/inn/blog/introduce/isaribi/,,
170003,,JJ0000000006,�ΐ쌧,����̏h�@���≮,�I���Z���m���h ���R�C����,onsennoyado yokoiwaya,,172049,,�ΐ쌧�֓��s���쒬�]�X�؃N-2,�ΐ쌧,�֓��s,���쒬�]�X�؃N-,2,,37.458079,137.076161,,,,"�`�F�b�N�C�� 15:00�`�F�b�N�A�E�g 9:30",,,"1��2�H 9,500�~�i�ŁA�����ō��j�@���N���W�b�g�J�[�h�s��",,150�N�O�̌Ö��Ƃ𗘗p�����͘F�����͂�ŁA�\�o�̋��y�����𖡂���Ă��������B,,"�E�֓��s�X���獑��249�����Ŏ�F���ʂ֖�25��,�E�u�]�X�،��v�o�X�₩��k��10��",�L��@8��,,,,,,,,,,,,,,,,,,,0768-32-0603,,,,,,,,https://wajima.gr.jp/yokoiwaya/index.htm,,
170003,,JJ0000000007,�ΐ쌧,���h�@���Ȃ�,�I���h�@�^�i�J,oyado�@tanaka,,172049,,�ΐ쌧�֓��s�͈䒬22-38,�ΐ쌧,�֓��s,�͈䒬,22-38,,37.39085214,136.90132,,,,"�`�F�b�N�C��  15:00�`�F�b�N�A�E�g  10:00",,,"�a���F15.550�~�`���ʎ��E�a�m���F22,150�~�`���ʗ����͊��S�\�񐧁i�ʗ����j�i�N���W�b�g�J�[�h��VISA�J�[�h�̂ݗ��p�j",,"�֓��̊X���ɘȂ�4�g����̑�l�̉B��h�B�ٓ��͎����ӂ񂾂�Ɏg���A�ǂɂ͌]���y��n���̓y���B�n���H�ނ̏{�����𖡂킢�A���򕗘C�Ŕ�������B�\�o�̐��𔑂܂�Ȃ���̊��ł����l����̏h�B",,"�E���򂩂�̂Ɨ��R�C���o�R��2���ԁi�u�̂Ɨ��R��`IC�v���ԁj�E�̂Ɨ��R��`IC�����25��,�E����w����֓����}�o�X�Ŗ�2����30���u�֓��w�O�v���ԁ@�k��10��",7��i�����j,,,,,,,,,,,,,,,,,,,0768-22-5155,,,,,,,,http://www.oyado-tanaka.jp/,,
170003,,JJ0000000008,�ΐ쌧,�֕��̏h�@����,���t�E�m���h�@�}���Q�c,wafunoyado�@mangetsu,,172049,,�ΐ쌧�֓��s�͈䒬20-1-44,�ΐ쌧,�֓��s,�͈䒬,20-1-44,,37.389132,136.907148,,,,"�`�F�b�N�C���@ 15:30�`�F�b�N�A�E�g�@9:00",,,"1��2�H�t�@11,480�~�`(R3�Q�l����)�����ŕ�150�~�i�N���W�b�g�J�[�h�s�j",,"����K�i�Ȃǂ͐@�����h��ŁA�L���͑S�ď��~���ł��B�L���K�i������2�K�͉�V���̘L���ŁA���������̓V��͊J����������܂��B�֓��h�̊���g�p�����G�߂̗��������������ƕ]���ŁA�J�����������V���C�������ł��B",,"�E����w����̂Ɨ��R�C���o�R�Ŗ�2���ԁi�̂Ɨ��R��`IC���ԁj�E�̂Ɨ��R��`IC�����20��,�E����w����֓����}�o�X��Ԗ�2����30���@�֓��w�O���ԁ@�k��5��",10�䂠��,,,,,,,,,,,,,,,,,,,0768-22-4487,,,,,,,,http://www.mangetsu.gr.jp/,,
170003,,JJ0000000009,�ΐ쌧,���h������,�~���V���N�E�J��,minshukukawa,,174637,,�ΐ쌧�P��S�\�o���L��20�]1�]1,�ΐ쌧,�\�o��,�ΐ쌧�P��S�\�o���L��,20�]1�]1,,37.255569,137.083872,,,,"�`�F�b�N�C���@15��00���`�@�`�F�b�N�A�E�g�@10��00��			",,,"1��2�H�@7,700�~�`�i�ō��݁A��l���A�����؍݂̕��͉����k�j			",,"�@�C�A�R�A�삪�ڂ̑O�ɍL�����D�̃��P�[�V�����ł��B�n���̋��������u��i�v�ƍD�]�ł��B�@�߂��ɂ́A���c�́u���򁕃v�[�� �Ȃ��݁v������A��̋��΁i������сj�𒭂߂Ȃ���A�I�V���C�𖞋i���邱�Ƃ��ł��܂��B���g��^�����������߂��A�T�b�J�[��e�j�X���ł���̂ŁA�X�|�[�c�̍��h�̏h���ɂ��g�����Ƃ��ł��܂��B",,"�̂Ɨ��R�C���\�o��`IC���40��			,",17��,,,,,,,,,,,,,,,,,,,0768-67-1014,,,,,,,,,,
170003,,JJ0000000010,�ΐ쌧,�\�o�C�^���A���Ɣ��y�H�̏h�@�ӂ����,�m�g�C�^���A���g�n�b�R�E�V���N�m���h�@�t���b�g,notoitariantohakkoshokunoyado�@furatto,,174637,,�ΐ쌧�P��S�\�o����g27��26�Ԓn��3�@,�ΐ쌧,�\�o��,�ΐ쌧�P��S�\�o����g,27��26�Ԓn��3�@,,37.280108,137.099348,,,,,,,"20,350�~�`�i�ō��j",,�I�[�X�g�����A�l�̎�l�����\�o�C�^���A���������ł��B�\�o�̋��y�H��V�N�ȋ���ނ��g�����C�^���A���Ńp�X�^�͖�����ł��̐��߂�A���ׂăV�[�t�[�h�̃R�[�X�ł��B����O�g����ŁA�W���Y�̗�����ԂŃI�[�X�g�����A���C���ƂƂ��ɂ��y���݂��������B,,",",,,,,,,,,,,,,,,,,,,,0768-62-1900,,,,,,,,http://flatt.jp/,,
170003,,JJ0000000011,�ΐ쌧,���h�ӂ�,�~���V���N�t��,minshukufuwa,,174637,,�ΐ쌧�P��S�\�o���F�o�ÃE124,�ΐ쌧,�\�o��,�ΐ쌧�P��S�\�o���F�o�ÃE,124,,37.304946,137.150019,,,,"�`�F�b�N�C���@16��00���`�`�F�b�N�A�E�g�@10��00��			",,,"1��2�H7,700�~�`��L�̗����͏���łȂǍ��݂̋��z�ł��B�i�N���W�b�g�J�[�h�s�j",,�@�\�o�����Y�u������v���g�����u�L�āv�ȂǁA���y������G�ߐ܁X�̐H�ނƋ��ɂɁA�\�o�̓c�ɂȂ�ł͂̉��������͋C�ł��ĂȂ��Ă���܂��B,,"�̂Ɨ��R�C���\�o��`IC���30��			,","7��			",,,,,,,,,,,,,,,,,,,0768-62-0150,,,,,,,,,,
170003,,JJ0000000012,�ΐ쌧,�������h�\�o��,�I�E�t�E�~���V���N�m�g�j�V�L,ofuminshukunotonishiki,,173843,,�ΐ쌧�H��S�u�꒬�u�꒬��샍-86,�ΐ쌧,�u�꒬,�ΐ쌧�H��S�u�꒬�u�꒬��샍-,86,,37.014904,136.744746,,,,,,,10���i6��j,,"��싙�`�������낷����Ɍ������̖��h�ł��B���[�̏o�D��C�J�ނ�D�̋���΂ȂǁA���{�C�̂��܂��܂ȕ\��𑋂̊O�Ɍ��邱�Ƃ��ł��܂��B���ɁA�[���̒��߂͍ō��ł��B�������͂މ�H�A�C�N�Y�ΏĂ����y���߂܂��B",,"�̂Ɨ��R�C�����RIC����10��JR�H��w���ԂŖ�25��,",20��,,,,,,,,,,,,,,,,,,,0767-32-4388,,,,,,,,,,
170003,,JJ0000000013,�ΐ쌧,�y���V�������J�t�F �N���[�Y,�y���V�����A���h�J�t�F �N���[�Y,penshonandokafue kuruzu,,173843,,�ΐ쌧�H��S�u�꒬��J�q��4�Ԓn32,�ΐ쌧,�u�꒬,�ΐ쌧�H��S�u�꒬��J�q��,4�Ԓn32,,37.01839466,136.7704736,,,,"�`�F�b�N�C���@�@15��00���`�F�b�N�A�E�g�@10��00��",,,,,"��������̎���L���g��u���L�̂�������A���X�̃A���e�B�[�N�B���[���b�p�̕Гc�ɂ̂悤�Ȃ������̃C���e���A�̒��A�a�m�ܒ��N���[�Y�������ĂȂ�������ݐؕ��C�ł������B�����Y��Ă����났�������B",,"�̂Ɨ��R�C�����RIC����7��,",11��,,,,,,,,,,,,,,,,,,,0767-32-3896,,,,,,,,https://pension-cruise.com/,,
170003,,JJ0000000014,�ΐ쌧,���咬�T�C�N�����O�^�[�~�i��,�E�`�i�_�}�`�T�C�N�����O�^�[�~�i��,uchinadamachisaikuringutaminaru,,173657,,�ΐ쌧�͖k�S���咬���咬�{���1-3,�ΐ쌧,���咬,�ΐ쌧�͖k�S���咬���咬�{���,1-3,,36.665634,136.652327,,,,"�`�F�b�N�C���@15��00���`�@�`�F�b�N�A�E�g�@�`10��00��			",,,"��ʁi���Z���ȏ�j�@�@  �@�@�@�@�a���@4,150�~�`�@�@�m���V���O���E�c�C���@6,150�~�`�@�@���w���@�@�@�@�@�@�@�@�@�@�@�@�@�@�@�a���@3,050�~�`�@�@�m���V���O���E�c�C���@5,150�~�`�@���w���ȉ��S�Έȏ�@  �@ �@�@�a���@2,900�~�`�@�@�m���V���O���E�c�C���@5,000�~�`�@�@�@�@�@�@�@�i���p�\�N���W�b�g�J�[�h�F�L��j",,�@�\�o�����̕t�����Ɉʒu���A����s�X�ɂ��߂����߁A����E�\�o�ό��̃A�N�Z�X���_�Ƃ��čœK�ł��B�{�ݎ��ӂ͊C�݂Ȃǂ̎��R�Ɉ͂܂�A��������̒��]�X�|�b�g�Ƃ��Đl�C�B�X�|�[�c�{�݂��[�����Ă���A���]�[�g�^�X�|�[�c���y���񂾂�A���h����̂ɂ��֗��ł��B�t�@�~���[�ɂ͏������q������ԑ�^�V��i�C���D�T���Z�b�g���j������A�܂��A��Ԃ�ŗ��Ă����ł����O�o�[�x�L���[���������߂ł�(�v�\��j�B,,"�E�k�������ԓ��@����IC����20���EJR����w���25��,JR����w����k�S�o�X��Ԉ��a�@���ԁA�k����20��(��1.5Km)�k�S����w������������w���Ԍ����w���߃��u�Z����ɂē��咬�����������ԓk����1��(��150m)",�����L��i���咬�����������@100��ȏ�j,,,,,,,,,,,,,,,,,,,076-286-3766,,,,,,,,http://www.nadasta.com,,
170003,,JJ0000000015,�ΐ쌧,�|�̉Y��,�^�P�m�E���J��,takenorakan,,172065,,�ΐ쌧����s�吹�����z���C19-1,�ΐ쌧,����s,�吹�����z���C,19-1,,36.295948,136.264586,,,,9��00���`17��00��,,,"�������p�\�N���W�b�g�J�[�h�@�Ȃ�",,"�ؑ��Z�ɂ����������̌��𗬎{�݂ŁA2003�i����15�j�N�ɃI�[�v�����܂����B�n��Z���̌𗬂̏�ŁA���܂��܂Ȏ��R�̌����ł��܂��B�ٓ��ł́A����������H�|�������J�Â���u���ړI�z�[���v�̓R���T�[�g����M�������[�Ƃ��Ďg�p�ł��܂��B�z�[���ł͓W���̔����\�ł��B�u�H�v�Ɋւ��銈���Ƃ��āA�̂Ȃ���̔��y�H�i�ɖڂ������A���Ɛ��́u�ւ����v�₽�����A���X�Ȃǂ̑̌��������s�Ȃ��Ă���A�̔������Ă��܂��B�ŋ߂͓��Ɂu�|�v�ɗ͂����Ă���A⡐|�A���|�A�Z�`���������|�A�Ȃǂ������̔����Ă��܂��B�܂��L�����v������݂��Ă��܂��B",,"�k�������ԓ�����IC����ԂŖ�7��JR�吹���w����ԂŖ�10��JR���ꉷ��w����ԂŖ�15��,JR���ꉷ��w���������V�o�X�@�L�����o�X����z�O���@���@36 �|�̉Y�كo�X�₩�炷��JR���ꉷ��w���畁�ʗ�Ԃ�4���i������ʂ�1�w�j�@���@JR�吹���w�����5.3m",��p�Ԗ�30��,,,,,,,,,,,,,,,,,,,0761-73-8812,,,,,,,,https://takenourakan.storeinfo.jp/,,
170003,,JJ0000000016,�ΐ쌧,���̉w�@�T��,�~�`�m�G�L�@�m���V,michinoeki�@noroshi,,172057,,�ΐ쌧��F�s�T�����e��11,�ΐ쌧,��F�s,�T�����e��,11,,37.52596051,137.3243649,,,,8��30���`17��00���i�G�߂ɂ���ĕύX�ɂȂ�ꍇ������܂��j,,,"���ꖳ���N���W�b�g�J�[�h�iVISA�AMaster�APayPay�ALINEPay�j",,"�@�\�o���������͂ĂɈʒu����T���ɂ́A�ό��X�|�b�g�ƂȂ�\����(�����������)���䂪����܂��B������́A�u�C���珸�钩���ƁA�C�ɒ��ޗ[���v�𓯂��ꏊ�Œ��߂邱�Ƃ��ł��܂��B �@���̉w�T���ł́A�����������̑�l�哤�Ǝ�F�Y�V�R�ɂ�����g�p�����Ìō܈�ؕs�g�p�̒n�������n�߁A���R���C�̐H�ނ����H�|�i�Ȃǂ��̔����Ă���܂��B",,"������ʂ����̂Ɨ��R�C���̂Ɨ��R��`IC�A��F���H�o�R��2����40���̂Ɨ��R��`������F���H�o�R�@��55���֓����ʂ�������249���o�R�@��50��,",��^�V��A���ʎԂV�P��i�g��җp�S��j�A�o�C�N��p�W��,,,,,,,,,,,,,,,,,,,0768-86-2525,,,,,,,,https://noroshi.info,,
170003,,JJ0000000017,�ΐ쌧,���̉w�@�������c��,�~�`�m�G�L�@�X�Y�G���f������,michinoeki�@suzuendemmura,,172057,,�ΐ쌧��F�s������1-58-1,�ΐ쌧,��F�s,������,1-58-1,,37.486335,137.113786,,,,"3���`11���F9��00���`17��00��12���`2���F9��00���`16��00��",,,"�y�����ٓ��ٗ��z�@��l100�~,���l(���w���ȉ�)50�~",,"�\�o�n����400�N�ȏ�O����`���u�g���l���v�ɂ�鐻�����s���Ȃ���A���̓`����`���邽�߂ɑ���ꂽ���̑��������قł��B�������i�F�𒭂߂Ȃ���̋x�e�₲���n�y�Y�̍w���A�g���l�������̑̌�(�v�\��)�ȂǁA���܂��܂ȗp�r�ŗ��p�ł��܂��B",,"��F�s��荑��249���o�R�@��30���֓��s��荑��249���o�R�@��30��,","���ʎ�30��E��^��6��E�g��җp3��i�����j			",,,,,,,,,,,,,,,,,,�ό��o�X�����Ă��鎞�ԂƏd�Ȃ�Ɠd�b�ɏo��Ȃ����Ƃ�����܂�,0768-87-2040,,,,,,,,http://enden.jp,,
170003,,JJ0000000018,�ΐ쌧,���̉w�@�����Ȃ�,�~�`�m�G�L�@�X�Y�i��,michinoeki�@suzunari,,172057,,�ΐ쌧��F�s��X�]���V-15,�ΐ쌧,��F�s,��X�]���V-,15,,37.44145125,137.2700942,,,,8��30���`18��00��,,,�i�N���W�b�g�J�[�h�s�j,,"�@����22�N4���A�H�ו��Ɛl�̌𗬋��_�Ƃ��āA�̂ƓS���̋���F�w�Ƀ��j���[�A���I�[�v�����܂����B�n����F�̏�񂪖��ڂł��B�X���ɂ͎�F�̂�����菤�i�������������ł��܂��B�g���l�����g�����\�t�g�N���[����A�G�߂��Ƃɕς�邲���n�\�t�g�ȂǁA�����ł������킦�Ȃ��A�C�X�ɂ��咍�ځB�@�n���̍̂ꂽ�ĐV�N��؂��͂��߁A��F�āA�]���y�R�����A�����َq�Ȃǂَ̉q�ށA��F�̉��ȂǁA��F�Y�ɂ�����蔲�������i�������Ă��܂��B",,"�̂Ɨ��R�C���E��F���H�o�R��2����30������249���o�R��50��,",��^��3��@���ʎ�39��@��Q�җp2��i�����j,,,,,,,,,,,,,,,,,,,0768-82-4688,,,,,,,,http://www.notohantou.jp/,,
170003,,JJ0000000019,�ΐ쌧,���̉w �疇�c�|�P�b�g�p�[�N,�~�`�m�G�L�@�Z���}�C�_�|�P�b�g�p�[�N,michinoeki�@semmaidapokettopaku,,172049,,�ΐ쌧�֓��s���Ē��n��99-5,�ΐ쌧,�֓��s,���Ē��n��,99-5,,37.424179,136.997614,,,,"8:30�`17:30�i�����̂���߂����Ԓ�8:30�`20:00�j��3��15��(��)����͂����̂���߂��I���ɔ����A8:30�`17:30�ɂȂ�܂��B���V�^�R���i�E�C���X�̊����g��󋵂ɂ��c�Ǝ��Ԃ��ύX�ƂȂ�ꍇ������܂��B",,,,,�\�o���\�����i�|�C���g�ł��B�i���n�u���Đ疇�c�v����]�ł��܂��B�\�o�������V�̗������X�|�b�g�Ƃ��Đl�C�ł��B�c�A������A�����̂���߂��Ȃǂ̃C�x���g������܂��B2022�N3��15��(��)����͂����̂���߂��I���ɔ����A�c�Ǝ��Ԃ͒ʏ��8:30�`17:30�ƂȂ��Ă���܂��B,,"�E���򂩂�̂Ɨ��R�C���o�R�Ŗ�2����20���i�u�̂Ɨ��R��`IC�v���ԁj�E�̂Ɨ��R��`IC�����35��,�E����w����֓����}�o�X��Ԗ�2����30���u�֓��w�O�v����(��芷��)���֓��w�O����H���o�X������u���Đ疇�c�v����",���Ɨp��51��A�o�X5��,,,,,,,,,,,,,,,,,,������Ё@�疇�c,0768-34-1004,,,,,,,,http://senmaida.wajima-kankou.jp/,,
170003,,JJ0000000020,�ΐ쌧,���̉w�֓��i�ӂ���ƖK���j,�~�`�m�G�L���W�}�i�t���b�g�z�[���j,michinoekiwajima�ifurattohomu�j,,172049,,�ΐ쌧�֓��s�͈䒬20-1-131,�ΐ쌧,�֓��s,�͈䒬,20-1-131,,37.389371,136.906015,,,,8:30�`18:00�i�킶�܊ό��ē��Z���^�[�j,,,"		",,"�֓��ɒ�������A�܂������ցB���֓��w�̐Ւn�ɂ���u���̉w �֓��v�A���́u�ӂ���ƖK���i�ف[�ށj�v�ł��B�c�Ǝ��Ԃ́A8:30�`18:00�i�N�����x�j�ł��B�ߘa4�N4��2��(�y)����8:30�`17:00�ɉc�Ǝ��Ԃ��ύX�ƂȂ�܂��B",,"�E���򂩂�̂Ɨ��R�C���o�R��2����(�u�̂Ɨ��R��`IC�v����)�E�̂Ɨ��R��`IC�����20��,�E����w����֓����}�o�X��Ԗ�2����30���u�֓��w�O�v����","���ʎ�12��A��^8��A�g��җp2��			",,,,,,,,,,,,,,,,,,,0768-22-1503,,,,,,,,https://wajimanavi.jp,,
170003,,JJ0000000021,�ΐ쌧,���̉w�@����  �@,�~�`�m�G�L�@�T�N���g�E�Q,michinoeki�@sakuratoge,,174637,,�ΐ쌧�P��S�\�o��������2-24-24,�ΐ쌧,�\�o��,�ΐ쌧�P��S�\�o��������,2-24-24,,37.331949,137.013073,,,,"9��00���`17��00��1�`3���@10��00���`16��00��",,,�N���W�b�g�J�[�h�s��,,�����ňꑧ�A�e�B�[�u���C�N�B�t�@���Ɉ������A�b�g�z�[���ȓ��̉w�ł��B�X���ɂ́u�\�o�l�v�̗D�����������Ղ�l�܂����̓��Y�i������������܂��B�\�o���̎v���o�ɂ��y�Y�𔃂����Ƃ��ł��܂��B�u���[�x���[�\�t�g�Ɨg�����ăJ���[�p���͂��X�̃C�`�I�V�ł��B�܂��\�o�̊ό��p���t���b�g���u���Ă���܂��̂ŁA�����W�ɂ����p���Ă��������B�x�e�ɁA�������ɁA�H���ɁA���Г��̉w�E�����ցB,,"�̂Ɨ��R�C���̂Ɨ��R��`IC�����F���H����F�s���ʂ�15���\�o��`����Ԃ�10��,","��^�� 3�����ʎԁ@ 29���g��җp 1��",,,,,,,,,,,,,,,,,,,0768-76-1518,,,,,,,,https://www.michi-no-eki.jp/stations/view/469,,
170003,,JJ0000000022,�ΐ쌧,���̉w�@�̂Ɨ��R��`,�~�`�m�G�L�@�m�g�T�g���}�N�E�R�E,michinoeki�@notosatoyamakuko,,172049,,�ΐ쌧�֓��s�O�䒬�F�q10-11-1,�ΐ쌧,�֓��s,�O�䒬�F�q,10-11-1,,37.295072,136.957185,,,,"(�r��) 8:30�`17:30(�\�o�̗� ���Z���^�[) 9:00�`17:00(���X�g��������̂�) 9:00�`16:00",,,,,�\�o��`�̎{�ݑS�������̉w�I�@4�K���Ă̋�`�^�[�~�i���ɂ́A�e��s���@�ւ������Ă��āA�󂾂��łȂ��A���̉w�Ƃ��Ă����p����Ă���B1�K�̊ό��C���t�H���[�V������1�A2�K�̔��X�A3�K�̃��X�g�����ȂǂƂĂ��֗��ł��B,,"�\�z�����ԓ��̂Ɨ��R��`IC�����F���ʂ֖�5���֓��s�����25����F�s�����55�������s(�a�q����)�����50��,",,,,,,,,,,,,,,,,,,,,0768-26-2555,,,,,,,,http://www.hot-ishikawa.jp/notonavi/,,
170003,,JJ0000000023,�ΐ쌧,���̉w�@�Ԑ_,�~�`�m�G�L�@�A�J�J�~,michinoeki�@akakami,,172049,,�ΐ쌧�֓��s��O���Ԑ_��-110,�ΐ쌧,�֓��s,��O���Ԑ_��-,110,,37.248314,136.709475,,,,"9:00�`17:00�i�~�G�A���ԕύX�L��j",,,,,"�T�̗��E��O�Łu����̂т��v���Ƃ��܂����B���{�C�̐������ɒ��ށA�����ːF�̗[���͂܂��ɐ�i�ł��B�߂��ɂ́A��{�R�`�����c�@�⋃�����̕l������܂��B����݂����͂��ߒn�����Y�i�������ƕ��сA���R������̃����v���W������Ă���͕̂K���ł��B",,"�E���򂩂�̂Ɨ��R�C����Ԗ�1����40���i���RIC���ԁj�E���RIC�����45��,�E����w����֓����}�o�X��Ԗ�2����30���u�֓��w�O�v����(��芷��)���u�֓��w�O�v����H���o�X(�֓���)�u��O�������O�v����(��芷��)���u��O�������O�v���爤�̂�o�X(�v��R�[�X)�Łu�Ԑ_�v�������{�������Ȃ����߂����ӂ�������",37��i��^��6��A���ʎ�31��j,,,,,,,,,,,,,,,,,,,0768-45-1001,,,,,,,,https://wajimanavi.jp/,,
170003,,JJ0000000024,�ΐ쌧,���̉w�@�Ƃ��C�X��,�~�`�m�G�L �g�M�E�~�J�C�h�E,michinoeki togiumikaido,,173843,,�ΐ쌧�H��S�u�꒬�x���̉ƒ��^-2-11,�ΐ쌧,�u�꒬,�ΐ쌧�H��S�u�꒬�x���̉ƒ��^-,2-11,,37.140164,136.724877,,,,"9��00���`17��00��",,,,,"�l�ӂɌ���T�N���L��A���{�C�̑��`�������͂ł��B�X���ɂ́A�L�׍H��\�o���Ȃǂ̕i�����т܂��B�n���̓��Y�i�u�����ÃG�r�v�̎����A�肪�ł���ȂǁA�C�Y���������Ă��܂��B�߂��ɂ́A�M�l�X�L�^�ɔF�肳�ꂽ���Ƃ�����u���E�꒷���x���`�v���͂��߁A�T�N���L���E���鑝��Y�C��(�܂��ق����炩������)�A�\�o�����A�ޖ�Ȃǂ�����܂��B",,"�̂Ɨ��R�C�����RIC���獑��249����k�֖�25�L�����򂩂��1����15��,JR�������u�H��w�v����u�x���s�v�̘H���o�X�u�x���v�o�X��ŉ��Ԃ��A�k����10��","���ʎ�75����^��3���g��җp1��",,,,,,,,,,,,,,,,,,,0767-42-0975,,,,,,,,http://togi-michinoeki.com/,,
170003,,JJ0000000025,�ΐ쌧,���̉w�@�̂Ƃ���,�~�`�m�G�L�@�m�g�W�},michinoeki�@notojima,,172022,,�ΐ쌧�����s�\�o�����c��122-14,�ΐ쌧,�����s,�\�o�����c��,122-14,,37.137359,136.998241,,,,"�i���R�[�i�[�j 9��00���`17��00�����c�Ǝ��Ԃ̕ύX��������ꍇ������܂��̂ŁA<a href=https://notojima-michinoeki.com/>�����g�o</a>�����m�F���������B",,,"���p�\�N���W�b�g�J�[�h:VISA,MasterCard",,"�\�o�ό��̋x�e�X�|�b�g�ɑI�ԂȂ�A��������Ԃ������߂ł��B�n���̎R�C�̍K�𖡂킦��H���R�[�i�[��A�\�o���̓y�Y���������y�Y�R�[�i�[�A�V�݂��ꂽ�l�ăR�[�i�[�����ɖ��͓I�ł��B",,"�̂Ɨ��R�C�����c���JCT�o�R�A�a�qIC�����10�L���A��20��,JR�������a�q����w���ԁA�\�o����ʁi�o�X�j��30��","��^��10��A���ʎ�272��			",,,,,,,,,,,,,,,,,,,0767-84-0225,,,,,,,,http://notojima-michinoeki.com/,,
170003,,JJ0000000026,�ΐ쌧,���̉w�@�Ȃ����܃��}����,�~�`�m�G�L�@�i�J�W�}���}���g�E�Q,michinoeki�@nakajimaromantoge,,172022,,�ΐ쌧�����s�����������j��1-19,�ΐ쌧,�����s,�����������j��,1-19,,37.130528,136.863199,,,,"�uYahata�����ׂ񒆓��X�v�ƌ��p�X�܂ƂȂ�܂��B�����ׂ񒆓��X�c�Ǝ��ԁ@7:00�`20:00",,,"���j���[�₨�y�Y���ɂ���ĈقȂ�܂�",,�@����249�������ɂ��铹�̉w�́A���w�薳�`�����������u���F�b�Ղ�i�����܂��ԂƁj�v�̐[�g�̘g���i�킭�΂��j�������ǂ����Ɩ������ڈ�ŁA���X�g��������Y�i�̔����A�x�e������̂ƂȂ�������������܂��B,,"�̂Ɨ��R�C�����cIC���ԁA�֓����ʂ�5�L�� �ԂŖ�7��JR�����w���獑��249�����������ʂ֖�18�L���A�ԂŖ�30��,","���ʎ�14��A��^��12��A�g��җp1��			",,,,,,,,,,,,,,,,,,2019�N7��4�����j���[�A���I�[�v���ɔ����ATEL/FAX���ύX���Ă���܂��B�i��0767-66-2151�j,0767-66-0155,,,,,,,,,,
170003,,JJ0000000027,�ΐ쌧,���̉w�@�\�o�H�Վs��,�~�`�m�G�L�@�m�g�V���N�T�C�C�`�o,michinoeki�@notoshokusaiichiba,,172022,,�ΐ쌧�����s�{�������O13-1�@����132���������`������,�ΐ쌧,�����s,�{�������O,13-1�@����132���������`������,,37.049024,136.968912,,,,"8��30���`18��00���i�O�����ق͓X�܂ɂ��قȂ�j���V�^�R���i�E�C���X�����ǂ̂��߁A�ߘa3�N1��21���`���ʂ̊ԉc�Ǝ��ԂɕύX����B�@�ڍׂ͂�����́u<a href=http://www.shokusai.co.jp/event/2021/01/113.html>�����z�[���y�[�W�̂��m�点</a>�v�ł��m�F���������B",,,���ꖳ��,,"�\�o�H�Վs��ł́u�����i�E�������E�����ڋ��v�����b�g�[�ɁA���I�����\�o�̖��𑽐���葵���Ă���܂��B1�K�ɂ͔\�o�̐V�N�ȋ���ނ���舵���u�\�o���N�s��v�A�\�o�e�n�̗��R���C�̓`���I�Ȗ���̊��ł���u���R���C���H�v�A�������̔\�o�̖��Y�i�E�`���H�|�i����葵�������R���C�S�ݓX�u���T���v�A��l�C�́u�l�Ă��R�[�i�[�v������܂��B2�K�͔\�o�̏{�̖��o�𑶕��Ɋy���߂�u�\�o�O�����فv������A���������Ƃ��y���݂��������܂��B�@�@�@�@�@�@�@�@�@�@�@�@�@�܂��A�u���̉w�v�u�݂ȂƃI�A�V�X�v�ɂ��F�肳��Ă���܂��B�u�\�o�H�Վs��v�Ŕ\�o���y���݁E������Ă��������I",,"JR�����w���k��10��������ʁ@�̂Ɨ��R�C���E���cIC���� ��15���x�R���ʁ@�\�z�����ԓ��E������RIC���� ��12��,",���ʎ�250�� ��^�o�X15��,,,,,,,,,,,,,,,,,,,0767-52-7071,,,,,,,,http://www.shokusai.co.jp/,,
170003,,JJ0000000028,�ΐ쌧,���̉w�@������,�~�`�m�G�L�@�C�I��,michinoeki�@iori,,172022,,�ΐ쌧�����s���������J��3-1,�ΐ쌧,�����s,���������J��,3-1,,37.028706,137.04653,,,,"��킭�킭�s��@10��00���`16��00��			",,,"�y�Y�Ȃǂɂ��قȂ�܂�			�i�N���W�b�g�J�[�h�s�j",,"�@�\�o���R�V�[�T�C�h���C�������Ɍ��u���̉w�v����́A��Y�C�݂���]���邱�Ƃ��ł��܂��B�@",,"�\�z�����ԓ������唑IC���獑��160�����������ʂ֖�5���̂ƓS�������������w����ԂŖ�20��,","���ʎ�52��A��^��5��			",,,,,,,,,,,,,,,,,,,0767-59-1415,,,,,,,,,,
170003,,JJ0000000029,�ΐ쌧,���̉w�@����`�̗�����,�~�`�m�G�L �R���K�L�m�T�g�V�J,michinoeki korogakinosatoshika,,173843,,�ΐ쌧�H��S�u�꒬���g�V�ی�22�Ԓn1,�ΐ쌧,�u�꒬,�ΐ쌧�H��S�u�꒬���g�V�ی�,22�Ԓn1,,37.00743465,136.7795652,,,,"�y�{�؊فz�@�@���@���@9��00���`17��30���@�y���j�@9��00���`18��30���y�A�N�A�p�[�N�@�V�I���z�@�@���@�@�@��@  9��00���`23��00���@�v�@�[�@���@  9��00���`22��00���@���X�g�����@11��00���`21��00��",,,"�y���@��z�@��l�i12�Έȏ�j500�~�A���l250�~�A3�Ζ��������A�Ⴊ���ҁi��l�j350�~�A�Ⴊ���ҁi���l�j�����y�v�[���z�@��l�i12�Έȏ�j550�~�A���l300�~�A3�Ζ��������A�Ⴊ���ҁi��l�j380�~�A�Ⴊ���ҁi���l�j�����y���򁕃v�[���z�@��l�i12�Έȏ�j800�~�A���l400�~�A3�Ζ��������A�Ⴊ���ҁi��l�j560�~�A�Ⴊ���ҁi���l�j����",,"����{�݁u�A�N�A�p�[�N �V�E�I���v��A���̓��Y�i��ߗה_�ƒ����̔_�Y����̔�����u�݂��̂��� �{�؊فv�Ȃǂ�����܂��B��É���u���炳���̓��v�ɒЂ����āA�u�ق��v�ƈꑧ���܂��񂩁B",,"�̂Ɨ��R�C�����RIC�����3���H��s��荑��249����k�ɖ�20��,JR�������u�H��w�v����u�x���s�v�̘H���o�X�u���l�v���Ԃ��A�k����10��","����RV�p�[�N5��",,,,,,,,,,,,,,,,,,�������u�{�؊فv,0767-32-4831,,,,,,,,http://syunsaikan-shika.jp/,,
170003,,JJ0000000030,�ΐ쌧,���̉w�@����,�~�`�m�G�L�@�^�J�}�c,michinoeki�@takamatsu,,172090,,�ΐ쌧���ق��s��c���t16-3,�ΐ쌧,���ق��s,��c���t,16-3,,36.786305,136.724686,,,,"���c�Ǝ����E�㉺���@�@�X�F�O�O����P�W�F�O�O",,,,,"�̂Ɨ��R�C���̍���IC�ƕďoIC�̒��Ԃɂ���A���X�ɂ͋ߗׂ̓��Y����X�C�[�c���[�����Ă��܂��B�h���C�u���̂ЂƋx�݂ɂǂ����B�܂��A���{�C�̗[������]�ł��A�������ɒ��ޗ[�������}���`�b�N�ł��B���������̃I���W�i�����j���[�ƂƂ��ɁA���ʂȎ��Ԃ����߂������������B��ʓ�����������p�����܂��̂ŁA�����Ō��IC��ڈ�ɂ��z�����������B",,"�k�������ԓ�����IC����̂Ɨ��R�C�����������ʂ�25��JR�����������w����ԂŖ�7��,���ق��s��������o�X","�y���R�فz[�̂Ɨ��R�C����]�g��� 2��@���^ 106��@��^ 9��@[��ʓ��H��]�g��� 2��@���^ 92���y���C�فz[�̂Ɨ��R�C����]�g��� 1��@���^ 97��@��^ 8��@[��ʓ��H��]���^ 6��",,,,,,,,,,,,,,,,,,,076-281-2221,,,,,,,,http://tak-rest.com/,,
170003,,JJ0000000031,�ΐ쌧,���̉w�@����T���Z�b�g�p�[�N,�~�`�m�G�L�@�E�`�i�_�T���Z�b�g�p�[�N,michinoeki�@uchinadasansettopaku,,173657,,�ΐ쌧�͖k�S���咬��w1����4-1,�ΐ쌧,���咬,�ΐ쌧�͖k�S���咬��w,1����4-1,,36.659151,136.648919,,,,���ԏ�E�g�C���@24���ԊJ��,,,,,"���咬�̍���Ɉʒu���铹�̉w�u����T���Z�b�g�p�[�N�v�́A���{�C�Ɖ͖k���ɂ͂��܂�A���R���痧�R�܂Ō��n�����D�̃��P�[�V�����B�T���Z�b�g�u���b�W����̃��C�g�A�b�v���ԋ߂Ō��邱�Ƃ��ł��A�f�[�g�X�|�b�g�Ƃ��Ă��l�C���W�߂Ă��܂��B�n�����咬��ΐ쌧���e�n�̔����������̂��M���b�Ƌl�܂������y�Y�R�[�i�[�uOTAKARA MARKET�v�ł��Ȃ������̂��C�ɓ���𔭌@����̂͂������ł��傤�H���H�R�[�i�[�ł́A�F�Ƃ�ǂ�̖ڂɂ��N�₩�ȃX�C�[�c���؂����Ղ�̃t�[�h�����\�ł��܂��I�V�����Ȃ������̉w����T���Z�b�g�p�[�N�A���񂨉z�����������I",,"�i�q����w����20���A�k�������ԓ����򓌂h�b����20��,�k���S�����������w���k���S���o�X���a�@�䂫��10���������ȑ�w�a�@�O���ԁ��k���������咬�R�~���j�e�B�o�X�S�����[�g��25��������T���Z�b�g�p�[�N���Ԃ���",�L��,,,,,,,,,,,,,,,,,,,--,,,,,,,,https://u-sp.jp,,
170003,,JJ0000000032,�ΐ쌧,���̉w�@���܂؏ꊃ�����ʂ̊ԁA�c�Ǝ��ԕύX,�~�`�m�G�L�@�R�}�c�L�o�K�^,michinoeki�@komatsukibagata,,172031,,�ΐ쌧�����s�@�㎛���P2-2,�ΐ쌧,�����s,�@�㎛���P,2-2,,36.3697242,136.4626293,,,,"�����ʂ̊ԁA���Z�c���������u�{�؎s�ꂶ�̂����v�@8��30���`18��00���i�G�ߕϓ�����j���X�g�����u���� �l�G�ʁv�@10���`16��30��(L.O.16��00��)",,,,,"����8���o�C�p�X�@�㎛IC�̂������΂ɂ���A�A�N�Z�X���ǍD�ł��B�u���������Ƃ₷�炬���o��w�v�Ƃ��ď����s�̂��܂��܂ȏ��𔭐M����{�݂ƂȂ��Ă��܂��B�@�_�ƃ��X�g�����u�����l�G�ʁv�ł́A�������Ă̏����s�Y�āu�u�āv�Ȃǒn���H�ނ��ӂ񂾂�Ɏg�p�������j���[��A�����m�Ԃ��������Ƃ����u�������ǂ�v�Ȃǂ̏����̖���񋟂��Ă��܂��B�������u�{�ʎs�ꂶ�̂����v�ł́A�̂ꂽ�ĐV�N�Ȓn���Y�_�Y����A���H�i�Ȃǂ����肾������B�����s�Y�̃g�}�g���ӂ񂾂�Ɏg���A������؎g�p�����g�}�g�̐��������Ŏd�グ���u�g�}�g�J���[�v�͂��E�߂̈�i�ł��B�����߂��ɂ́A���R�̒��]���ǂ��A�s���̌e���̏�Ƃ��Ēm����؏ꊃ����������A�U���T�C�N�����O���y���ގ����ł��܂��B",,"�k�������ԓ�����IC���20��(��15Km)JR�k���{�������w����20��(��10Km)JR�k���{�����Éw����10��(��5Km)������`����20��(��15Km),",,,,,,,,,,,,,,,,,,,,0761-25-1188,,,,,,,,http://www.michinoeki-kibagata.com/,,